Target
Beta-galactosidase
Ligand
BDBM18355
Substrate
Meas. Tech.
ChEMBL_701784 (CHEMBL1656921)
IC50
750000±n/a nM
Citation
 Ghisaidoobe, ABikker, Pde Bruijn, ACGodschalk, FDRogaar, EGuijt, MCHagens, PHalma, JMHart, SMLuitjens, SBvan Rixel, VHWijzenbroek, MZweegers, TDonker-Koopman, WEStrijland, ABoot, RMarel, GvOverkleeft, HSAerts, JM Identification of Potent and Selective Glucosylceramide Synthase Inhibitors from a Library of N-Alkylated Iminosugars ACS Med Chem Lett 2:119-123 (2011)  
Target
Name:
Beta-galactosidase
Synonyms:
Acid beta-galactosidase Bgl Glb1 | Lactase
Type:
PROTEIN
Mol. Mass.:
73125.63
Organism:
Mus musculus
Description:
ChEMBL_701784
Residue:
647
  
Inhibitor
Name:
BDBM18355
Synonyms:
(2R,3R,4R,5S)-1-butyl-2-(hydroxymethyl)piperidine-3,4,5-triol MIGLUSTAT US20230339856, Compound NB-DNJ | US9181184, 5
Type:
Small organic molecule
Emp. Form.:
C10H21NO4
Mol. Mass.:
219.278
SMILES:
CCCCN1C[C@H](O)[C@@H](O)[C@H](O)[C@H]1CO
: