Target
Ceramide glucosyltransferase
Ligand
BDBM50299749
Substrate
Meas. Tech.
ChEMBL_701780 (CHEMBL1656917)
IC50
200±n/a nM
Citation
 Ghisaidoobe, ABikker, Pde Bruijn, ACGodschalk, FDRogaar, EGuijt, MCHagens, PHalma, JMHart, SMLuitjens, SBvan Rixel, VHWijzenbroek, MZweegers, TDonker-Koopman, WEStrijland, ABoot, RMarel, GvOverkleeft, HSAerts, JM Identification of Potent and Selective Glucosylceramide Synthase Inhibitors from a Library of N-Alkylated Iminosugars ACS Med Chem Lett 2:119-123 (2011)  
Target
Name:
Ceramide glucosyltransferase
Synonyms:
CEGT_MOUSE | Ugcg
Type:
PROTEIN
Mol. Mass.:
44844.15
Organism:
Mus musculus
Description:
ChEMBL_809643
Residue:
394
  
Inhibitor
Name:
BDBM50299749
Synonyms:
(2R,3R,4R,5S)-1-[5-(Adamantan-1-ylmethoxy)-pentyl]-2-hydroxymethyl-piperidine-3,4,5-triol N-adamantanemethyloxypentyl-1-deoxynojirimycin
Type:
Small organic molecule
Emp. Form.:
C22H39NO5
Mol. Mass.:
397.5488
SMILES:
OC[C@@H]1[C@@H](O)[C@H](O)[C@@H](O)CN1CCCCCOCC12CC3CC(CC(C3)C1)C2
: