Target
Lutropin-choriogonadotropic hormone receptor
Ligand
BDBM50335475
Substrate
Meas. Tech.
ChEMBL_702109 (CHEMBL1655339)
EC50
80±n/a nM
Citation
 Bonger, KMHoogendoorn, Svan Koppen, CJTimmers, CMMarel, GA Development of Selective LH Receptor Agonists by Heterodimerization with a FSH Receptor Antagonist ACS Med Chem Lett 2:85-89 (2011)  
Target
Name:
Lutropin-choriogonadotropic hormone receptor
Synonyms:
LCGR LH/CG-R LHR LSH-R Luteinizing hormone receptor
Type:
PROTEIN
Mol. Mass.:
78662.77
Organism:
Homo sapiens (Human)
Description:
ChEMBL_562598
Residue:
699
  
Inhibitor
Name:
BDBM50335475
Synonyms:
(S)-4-(3-(2-((1-(2-(2-(4-((4-(1-acetyl-6-biphenyl-4-ylcarboxamido-2,2,4-trimethyl-1,2,3,4-tetrahydroquinolin-4-yl)phenoxy)methyl)-1H-1,2,3-triazol-1-yl)ethoxy)ethyl)-1H-1,2,3-triazol-4-yl)methylamino)-2-oxoethylamino)phenyl)-5-amino-N-tert-butyl-2-(methylthio)thieno[2,3-d]pyrimidine-6-carboxamide | CHEMBL1651830
Type:
Small organic molecule
Emp. Form.:
C63H68N14O6S2
Mol. Mass.:
1181.434
SMILES:
CSc1nc(-c2cccc(NCC(=O)NCc3cn(CCOCCn4cc(COc5ccc(cc5)[C@]5(C)CC(C)(C)N(C(C)=O)c6ccc(NC(=O)c7ccc(cc7)-c7ccccc7)cc56)nn4)nn3)c2)c2c(N)c(sc2n1)C(=O)NC(C)(C)C
: