Target
Beta-lactamase
Ligand
BDBM50335563
Substrate
Meas. Tech.
ChEMBL_715808 (CHEMBL1663883)
Ki
500±n/a nM
Citation
 Rodríguez-Martínez, JMNordmann, PRonco, EPoirel, L Extended-spectrum cephalosporinase in Acinetobacter baumannii. Antimicrob Agents Chemother 54:3484-8 (2010)  
Target
Name:
Beta-lactamase
Synonyms:
ADC-11
Type:
PROTEIN
Mol. Mass.:
43250.25
Organism:
Acinetobacter baumannii
Description:
ChEMBL_715813
Residue:
383
  
Inhibitor
Name:
BDBM50335563
Synonyms:
(6R,7R)-3-(carbamoyloxymethyl)-7-methoxy-8-oxo-7-(2-(thiophen-2-yl)acetamido)-5-thia-1-aza-bicyclo[4.2.0]oct-2-ene-2-carboxylic acid (6R,7S)-3-Carbamoyloxymethyl-7-methoxy-8-oxo-7-(2-thiophen-2-yl-acetylamino)-5-thia-1-aza-bicyclo[4.2.0]oct-2-ene-2-carboxylic acid (6S,7R)-3-(carbamoyloxymethyl)-7-methoxy-8-oxo-7-(2-(thiophen-2-yl)acetamido)-5-thia-1-aza-bicyclo[4.2.0]oct-2-ene-2-carboxylic acid 3-Carbamoyloxymethyl-7-methoxy-8-oxo-7-(2-thiophen-2-yl-acetylamino)-5-thia-1-aza-bicyclo[4.2.0]oct-2-ene-2-carboxylic acid 3-Carbamoyloxymethyl-7-methoxy-8-oxo-7-(2-thiophen-3-yl-acetylamino)-5-thia-1-aza-bicyclo[4.2.0]oct-2-ene-2-carboxylic acid anion Cefoxitin Cenomycin Mefoxitin
Type:
Small organic molecule
Emp. Form.:
C16H17N3O7S2
Mol. Mass.:
427.452
SMILES:
CO[C@]1(NC(=O)Cc2cccs2)[C@H]2SCC(COC(N)=O)=C(N2C1=O)C(O)=O
: