Target
Acetylcholinesterase
Ligand
BDBM50199522
Substrate
Meas. Tech.
ChEMBL_714889 (CHEMBL1663835)
IC50
1700±n/a nM
Citation
 Matochko, WLJames, ALam, CWKozera, DJAta, AGengan, RM Triterpenoidal alkaloids from Buxus natalensis and their acetylcholinesterase inhibitory activity. J Nat Prod 73:1858-62 (2010)  
Target
Name:
Acetylcholinesterase
Synonyms:
ACES_HUMAN Acetylcholinesterase (AChE) | Acetylcholinesterase (human AChE)
Type:
Enzyme
Mol. Mass.:
67792.70
Organism:
Homo sapiens (Human)
Description:
P22303
Residue:
614
  
Inhibitor
Name:
BDBM50199522
Synonyms:
(+)-huperzine A (-)-1-Amino-13-ethylidene-11-methyl-6-aza-tricyclo[7.3.1.0*2,7*]trideca-2(7),3,10-trien-5-one(Huperzine A) (-)-huperzine A (1R,9R)-1-Amino-13-eth-(E)-ylidene-11-methyl-6-aza-tricyclo[7.3.1.0*2,7*]trideca-2(7),3,10-trien-5-one (R)-1-Amino-13-ethylidene-11-methyl-6-aza-tricyclo[7.3.1.0*2,7*]trideca-2(7),3,10-trien-5-one 1-Amino-13-eth-(E)-ylidene-11-methyl-6-aza-tricyclo[7.3.1.0*2,7*]trideca-2(7),3,10-trien-5-one 1-Amino-13-ethylidene-11-methyl-6-aza-tricyclo[7.3.1.0*2,7*]trideca-2(7),3,10-trien-5-one 1-Amino-13-ethylidene-11-methyl-6-aza-tricyclo[7.3.1.0*2,7*]trideca-2(7),3,10-trien-5-one((-)-Huperzine A) CHEMBL395280 Hyperazzine A
Type:
Small organic molecule
Emp. Form.:
C15H18N2O
Mol. Mass.:
242.3162
SMILES:
C\C=C1/[C@@H]2Cc3[nH]c(=O)ccc3[C@@]1(N)CC(C)=C2
: