Target
Death-associated protein kinase 3
Ligand
BDBM50335638
Substrate
Meas. Tech.
ChEMBL_714650 (CHEMBL1663328)
IC50
17±n/a nM
Citation
 Pierre, FChua, PCO'Brien, SESiddiqui-Jain, ABourbon, PHaddach, MMichaux, JNagasawa, JSchwaebe, MKStefan, EVialettes, AWhitten, JPChen, TKDarjania, LStansfield, RAnderes, KBliesath, JDrygin, DHo, COmori, MProffitt, CStreiner, NTrent, KRice, WGRyckman, DM Discovery and SAR of 5-(3-chlorophenylamino)benzo[c][2,6]naphthyridine-8-carboxylic acid (CX-4945), the first clinical stage inhibitor of protein kinase CK2 for the treatment of cancer. J Med Chem 54:635-54 (2011)  
Target
Name:
Death-associated protein kinase 3
Synonyms:
DAP kinase 3 DAPK3 ZIP-kinase | ZIPK
Type:
PROTEIN
Mol. Mass.:
52537.07
Organism:
Homo sapiens (Human)
Description:
ChEMBL_586564
Residue:
454
  
Inhibitor
Name:
BDBM50335638
Synonyms:
5-(3-Chlorophenylamino)benzo[c][2,6]naphthyridine-8-carboxylic acid CHEMBL1230165 US9062043, Table 13, Compound 17 | US9062043, Table 20b, Compound 12
Type:
Small organic molecule
Emp. Form.:
C19H12ClN3O2
Mol. Mass.:
349.77
SMILES:
OC(=O)c1ccc2c(c1)nc(Nc1cccc(Cl)c1)c1ccncc21
: