Target
Serine/threonine-protein kinase Chk2
Ligand
BDBM50335643
Substrate
Meas. Tech.
ChEMBL_714871 (CHEMBL1663817)
IC50
1500±n/a nM
Citation
 Caldwell, JJWelsh, EJMatijssen, CAnderson, VEAntoni, LBoxall, KUrban, FHayes, ARaynaud, FIRigoreau, LJRaynham, TAherne, GWPearl, LHOliver, AWGarrett, MDCollins, I Structure-based design of potent and selective 2-(quinazolin-2-yl)phenol inhibitors of checkpoint kinase 2. J Med Chem 54:580-90 (2011)  
Target
Name:
Serine/threonine-protein kinase Chk2
Synonyms:
CDS1 CHK2 Checkpoint Kinase (Chk2) Serine/threonine-protein kinase Chek2 | Serine/threonine-protein kinase Chk1/2
Type:
Protein
Mol. Mass.:
60908.59
Organism:
Homo sapiens (Human)
Description:
O96017
Residue:
543
  
Inhibitor
Name:
BDBM50335643
Synonyms:
(R)-2-(4-(3-(dimethylamino)pyrrolidin-1-yl)quinazolin-2-yl)phenol | CHEMBL1650094
Type:
Small organic molecule
Emp. Form.:
C20H22N4O
Mol. Mass.:
334.4149
SMILES:
CN(C)[C@@H]1CCN(C1)c1nc(nc2ccccc12)-c1ccccc1O
: