Target
Serine/threonine-protein kinase Chk2
Ligand
BDBM50335666
Substrate
Meas. Tech.
ChEMBL_714871 (CHEMBL1663817)
IC50
460±n/a nM
Citation
 Caldwell, JJWelsh, EJMatijssen, CAnderson, VEAntoni, LBoxall, KUrban, FHayes, ARaynaud, FIRigoreau, LJRaynham, TAherne, GWPearl, LHOliver, AWGarrett, MDCollins, I Structure-based design of potent and selective 2-(quinazolin-2-yl)phenol inhibitors of checkpoint kinase 2. J Med Chem 54:580-90 (2011)  
Target
Name:
Serine/threonine-protein kinase Chk2
Synonyms:
CDS1 CHK2 Checkpoint Kinase (Chk2) Serine/threonine-protein kinase Chek2 | Serine/threonine-protein kinase Chk1/2
Type:
Protein
Mol. Mass.:
60908.59
Organism:
Homo sapiens (Human)
Description:
O96017
Residue:
543
  
Inhibitor
Name:
BDBM50335666
Synonyms:
4-fluoro-2-(4-((3S,5R)-5-(2-hydroxypropan-2-yl)pyrrolidin-3-ylamino)quinazolin-2-yl)phenol | CHEMBL1650114
Type:
Small organic molecule
Emp. Form.:
C21H23FN4O2
Mol. Mass.:
382.4313
SMILES:
CC(C)(O)[C@H]1C[C@@H](CN1)Nc1nc(nc2ccccc12)-c1cc(F)ccc1O
: