Target
Dipeptidyl peptidase 8
Ligand
BDBM50335767
Substrate
Meas. Tech.
ChEMBL_715156 (CHEMBL1664315)
IC50
>100000±n/a nM
Citation
 Zhang, ZWallace, MBFeng, JStafford, JASkene, RJShi, LLee, BAertgeerts, KJennings, AXu, RKassel, DBKaldor, SWNavre, MWebb, DRGwaltney, SL Design and synthesis of pyrimidinone and pyrimidinedione inhibitors of dipeptidyl peptidase IV. J Med Chem 54:510-24 (2011)  
Target
Name:
Dipeptidyl peptidase 8
Synonyms:
DPP8 DPRP-1 Dipeptidyl peptidase 8 (DPP-8) Dipeptidyl peptidase 8/9 Dipeptidyl peptidase VIII Prolyl dipeptidase DPP8
Type:
Enzyme
Mol. Mass.:
103342.62
Organism:
Homo sapiens (Human)
Description:
Q6V1X1
Residue:
898
  
Inhibitor
Name:
BDBM50335767
Synonyms:
2-[2-(3-(R)-Aminopiperidin-1-yl)-6-oxo-4-phenyl-6H-pyrimidin-1-ylmethyl]benzonitrile | CHEMBL1650412
Type:
Small organic molecule
Emp. Form.:
C23H23N5O
Mol. Mass.:
385.4616
SMILES:
N[C@@H]1CCCN(C1)c1nc(cc(=O)n1Cc1ccccc1C#N)-c1ccccc1
: