Target
Dipeptidyl peptidase 4
Ligand
BDBM50335794
Substrate
Meas. Tech.
ChEMBL_715155 (CHEMBL1664314)
IC50
8±n/a nM
Citation
 Zhang, ZWallace, MBFeng, JStafford, JASkene, RJShi, LLee, BAertgeerts, KJennings, AXu, RKassel, DBKaldor, SWNavre, MWebb, DRGwaltney, SL Design and synthesis of pyrimidinone and pyrimidinedione inhibitors of dipeptidyl peptidase IV. J Med Chem 54:510-24 (2011)  
Target
Name:
Dipeptidyl peptidase 4
Synonyms:
ADABP Adenosine deaminase complexing protein 2 CD_antigen=CD26 DPP4 DPPIV Dipeptidyl peptidase 4 (DPP IV) Dipeptidyl peptidase 4 (DPP4) Dipeptidyl peptidase 4 membrane form Dipeptidyl peptidase IV Dipeptidyl peptidase IV (DDP-IV) Dipeptidyl peptidase IV membrane form Dipeptidyl peptidase-IV (DPP-4) T-cell activation antigen CD26 | TP103
Type:
Enzyme
Mol. Mass.:
88271.01
Organism:
Homo sapiens (Human)
Description:
P27487
Residue:
766
  
Inhibitor
Name:
BDBM50335794
Synonyms:
2-((2-(3-(R)-Aminopiperidin-1-yl)-5-chloro-6-oxopyrimidin-1(6H)-yl)methyl)-4-fluorobenzonitrile | CHEMBL1650433
Type:
Small organic molecule
Emp. Form.:
C17H17ClFN5O
Mol. Mass.:
361.801
SMILES:
N[C@@H]1CCCN(C1)c1ncc(Cl)c(=O)n1Cc1cc(F)ccc1C#N
: