Target
Dipeptidyl peptidase 8
Ligand
BDBM50335788
Substrate
Meas. Tech.
ChEMBL_715156 (CHEMBL1664315)
IC50
>100000±n/a nM
Citation
 Zhang, ZWallace, MBFeng, JStafford, JASkene, RJShi, LLee, BAertgeerts, KJennings, AXu, RKassel, DBKaldor, SWNavre, MWebb, DRGwaltney, SL Design and synthesis of pyrimidinone and pyrimidinedione inhibitors of dipeptidyl peptidase IV. J Med Chem 54:510-24 (2011)  
Target
Name:
Dipeptidyl peptidase 8
Synonyms:
DPP8 DPRP-1 Dipeptidyl peptidase 8 (DPP-8) Dipeptidyl peptidase 8/9 Dipeptidyl peptidase VIII Prolyl dipeptidase DPP8
Type:
Enzyme
Mol. Mass.:
103342.62
Organism:
Homo sapiens (Human)
Description:
Q6V1X1
Residue:
898
  
Inhibitor
Name:
BDBM50335788
Synonyms:
6-[3-(R)-Aminopiperidin-1-yl]-1-(2-bromobenzyl)-3-methyl-1H-pyrimidine-2,4-dione | CHEMBL1650439
Type:
Small organic molecule
Emp. Form.:
C17H21BrN4O2
Mol. Mass.:
393.278
SMILES:
Cn1c(=O)cc(N2CCC[C@@H](N)C2)n(Cc2ccccc2Br)c1=O
: