Target
cGMP-specific 3',5'-cyclic phosphodiesterase
Ligand
BDBM50335835
Substrate
Meas. Tech.
ChEMBL_715329 (CHEMBL1664616)
IC50
1110±n/a nM
Citation
 Mohamed, HAGirgis, NMWilcken, RBauer, MRTinsley, HNGary, BDPiazza, GABoeckler, FMAbadi, AH Synthesis and molecular modeling of novel tetrahydro-ß-carboline derivatives with phosphodiesterase 5 inhibitory and anticancer properties. J Med Chem 54:495-509 (2011)  
Target
Name:
cGMP-specific 3',5'-cyclic phosphodiesterase
Synonyms:
3',5'-cyclic phosphodiesterase PDE5 PDE5A_HUMAN Phosphodiesterase 5 (PDE5) Phosphodiesterase 5A (PDE5A) cGMP-specific 3',5'-cyclic phosphodiesterase
Type:
Protein
Mol. Mass.:
99975.83
Organism:
Homo sapiens (Human)
Description:
O76074
Residue:
875
  
Inhibitor
Name:
BDBM50335835
Synonyms:
(6S,12aR)6-(2,4-Dichlorophenyl)-2-butyl-2,3,6,7,12,12a-hexahydropyrazino[1',2':1,6]pyrido[3,4-b]indole-1,4-dione | CHEMBL1650877
Type:
Small organic molecule
Emp. Form.:
C24H23Cl2N3O2
Mol. Mass.:
456.364
SMILES:
CCCCN1CC(=O)N2[C@H](Cc3c([nH]c4ccccc34)[C@@H]2c2ccc(Cl)cc2Cl)C1=O
: