Target
cGMP-inhibited 3',5'-cyclic phosphodiesterase 3B
Ligand
BDBM50335827
Substrate
Meas. Tech.
ChEMBL_715332 (CHEMBL1664619)
IC50
>50000±n/a nM
Citation
 Mohamed, HAGirgis, NMWilcken, RBauer, MRTinsley, HNGary, BDPiazza, GABoeckler, FMAbadi, AH Synthesis and molecular modeling of novel tetrahydro-ß-carboline derivatives with phosphodiesterase 5 inhibitory and anticancer properties. J Med Chem 54:495-509 (2011)  
Target
Name:
cGMP-inhibited 3',5'-cyclic phosphodiesterase 3B
Synonyms:
CGI-PDE B CGIPDE1 PDE3B Phosphodiesterase 3B Phosphodiesterase Type 3 (PDE3B) cGMP-inhibited 3,5-cyclic phosphodiesterase B
Type:
Enzyme
Mol. Mass.:
124318.95
Organism:
Homo sapiens (Human)
Description:
PDE3B was generated from the full-length recombinant human clone transfected into Sf9 cells.
Residue:
1112
  
Inhibitor
Name:
BDBM50335827
Synonyms:
(6R,12aR)6-(2,4-Dichlorophenyl)-2-ethyl-2,3,6,7,12,12a-hexahydropyrazino[1',2':1,6]pyrido[3,4-b]indole-1,4-dione | CHEMBL1650866
Type:
Small organic molecule
Emp. Form.:
C22H19Cl2N3O2
Mol. Mass.:
428.311
SMILES:
CCN1CC(=O)N2[C@H](Cc3c([nH]c4ccccc34)[C@H]2c2ccc(Cl)cc2Cl)C1=O
: