Target
Tyrosine-protein phosphatase non-receptor type 22
Ligand
BDBM50335866
Substrate
Meas. Tech.
ChEMBL_715337 (CHEMBL1664624)
IC50
340±n/a nM
Citation
 Vang, TXie, YLiu, WHVidovic, DLiu, YWu, SSmith, DHRinderspacher, AChung, CGong, GMustelin, TLandry, DWRickert, RCSchürer, SCDeng, SXTautz, L Inhibition of lymphoid tyrosine phosphatase by benzofuran salicylic acids. J Med Chem 54:562-71 (2011)  
Target
Name:
Tyrosine-protein phosphatase non-receptor type 22
Synonyms:
3.1.3.48 LyP Lymphoid phosphatase (Lyp) PEST-domain phosphatase PTPN22 Tyrosine-protein phosphatase non-receptor type 22 (LYP) | tyrosine-protein phosphatase non-receptor type 22 isoform 1
Type:
Mol. Mass.:
91712.31
Organism:
Homo sapiens (Human)
Description:
Q9Y2R2
Residue:
807
  
Inhibitor
Name:
BDBM50335866
Synonyms:
6-hydroxy-2-(4-methoxyphenyl)-3-(1-(4-(4-nitronaphthalen-1-ylamino)-4-oxobutyl)-1H-1,2,3-triazol-4-yl)benzofuran-5-carboxylic acid | CHEMBL1650890
Type:
Small organic molecule
Emp. Form.:
C32H25N5O8
Mol. Mass.:
607.5696
SMILES:
COc1ccc(cc1)-c1oc2cc(O)c(cc2c1-c1cn(CCCC(=O)Nc2ccc([N+]([O-])=O)c3ccccc23)nn1)C(O)=O
: