Target
Cannabinoid receptor 1
Ligand
BDBM50180036
Substrate
Meas. Tech.
ChEMBL_717852 (CHEMBL1670560)
Ki
677±n/a nM
Citation
 Brogi, SCorelli, FDi Marzo, VLigresti, AMugnaini, CPasquini, STafi, A Three-dimensional quantitative structure-selectivity relationships analysis guided rational design of a highly selective ligand for the cannabinoid receptor 2. Eur J Med Chem 46:547-55 (2011)  
Target
Name:
Cannabinoid receptor 1
Synonyms:
CANN6 CB-R CNR CNR1_HUMAN Cannabinoid receptor Cannabinoid receptor 1 (brain)
Type:
G Protein-Coupled Receptor (GPCR)
Mol. Mass.:
52868.96
Organism:
Homo sapiens (Human)
Description:
P21554
Residue:
472
  
Inhibitor
Name:
BDBM50180036
Synonyms:
(6aR,10aR)-3-(1,1-dimethylbutyl)-6a,7,10,10a-tetrahydro-6,6,9-trimethyl-6Hdibenzo[b,d]pyran CHEMBL371214 | JWH-133
Type:
Small organic molecule
Emp. Form.:
C22H32O
Mol. Mass.:
312.4889
SMILES:
CCCC(C)(C)c1ccc2[C@@H]3CC(C)=CC[C@H]3C(C)(C)Oc2c1
: