Target
Bifunctional epoxide hydrolase 2
Ligand
BDBM50335979
Substrate
Meas. Tech.
ChEMBL_716996 (CHEMBL1671068)
IC50
185±n/a nM
Citation
 Anandan, SKWebb, HKChen, DWang, YXAavula, BRCases, SCheng, YDo, ZNMehra, UTran, VVincelette, JWaszczuk, JWhite, KWong, KRZhang, LNJones, PDHammock, BDPatel, DVWhitcomb, RMacIntyre, DESabry, JGless, R 1-(1-acetyl-piperidin-4-yl)-3-adamantan-1-yl-urea (AR9281) as a potent, selective, and orally available soluble epoxide hydrolase inhibitor with efficacy in rodent models of hypertension and dysglycemia. Bioorg Med Chem Lett 21:983-8 (2011)  
Target
Name:
Bifunctional epoxide hydrolase 2
Synonyms:
Cytosolic epoxide hydrolase 2 EPHX2 HYES_HUMAN Soluble epoxide hydrolase (sEH) | epoxide hydrolase 2, cytoplasmic
Type:
Enzyme
Mol. Mass.:
62613.07
Organism:
Homo sapiens (Human)
Description:
P34913
Residue:
555
  
Inhibitor
Name:
BDBM50335979
Synonyms:
1-(1-acetylpiperidin-4-yl)-3-(4,4-difluorocyclohexyl)urea | CHEMBL1668931
Type:
Small organic molecule
Emp. Form.:
C14H23F2N3O2
Mol. Mass.:
303.3481
SMILES:
CC(=O)N1CCC(CC1)NC(=O)NC1CCC(F)(F)CC1
: