Target
Lactoylglutathione lyase
Ligand
BDBM50295287
Substrate
Meas. Tech.
ChEMBL_716549 (CHEMBL1670273)
Ki
87800±n/a nM
Citation
 Yuan, MLuo, MSong, YXu, QWang, XCao, YBu, XRen, YHu, X Identification of curcumin derivatives as human glyoxalase I inhibitors: A combination of biological evaluation, molecular docking, 3D-QSAR and molecular dynamics simulation studies. Bioorg Med Chem 19:1189-96 (2011)  
Target
Name:
Lactoylglutathione lyase
Synonyms:
Aldoketomutase Glx I Glyoxalase I LGUL_HUMAN S-D-lactoylglutathione methylglyoxal lyase
Type:
Enzyme
Mol. Mass.:
20772.95
Organism:
Homo sapiens (Human)
Description:
Q04760
Residue:
184
  
Inhibitor
Name:
BDBM50295287
Synonyms:
2-(1-methyl-5-(4-methylbenzoyl)-1H-pyrrol-2-yl)acetic acid MCN-2559 Tolectin [1-Methyl-5-(4-methyl-benzoyl)-1H-pyrrol-2-yl]-acetic acid(tolmetin)
Type:
Small organic molecule
Emp. Form.:
C15H15NO3
Mol. Mass.:
257.2845
SMILES:
Cc1ccc(cc1)C(=O)c1ccc(CC(O)=O)n1C
: