Target
Mineralocorticoid receptor
Ligand
BDBM50336278
Substrate
Meas. Tech.
ChEMBL_716553 (CHEMBL1670277)
IC50
2780±n/a nM
Citation
 Jiang, CSZhou, RGong, JXChen, LLKurtán, TShen, XGuo, YW Synthesis, modification, and evaluation of (R)-de-O-methyllasiodiplodin and analogs as nonsteroidal antagonists of mineralocorticoid receptor. Bioorg Med Chem Lett 21:1171-5 (2011)  
Target
Name:
Mineralocorticoid receptor
Synonyms:
MCR_RAT Mineralocorticoid Receptor (MR) Mlr Nuclear receptor subfamily 3 group C member 2 | mineralocorticoid
Type:
Enzyme Catalytic Domain
Mol. Mass.:
106748.15
Organism:
RAT
Description:
mineralocorticoid 0 RAT::P22199
Residue:
981
  
Inhibitor
Name:
BDBM50336278
Synonyms:
(R)-3-methyl-1-oxo-3,4,5,6,7,8,9,10-octahydro-1H-benzo[c][1]oxacyclododecine-12,14-diyl diacetate | CHEMBL1669762
Type:
Small organic molecule
Emp. Form.:
C20H26O6
Mol. Mass.:
362.4168
SMILES:
C[C@@H]1CCCCCCCc2cc(OC(C)=O)cc(OC(C)=O)c2C(=O)O1
: