Target
Progesterone receptor
Ligand
BDBM50336276
Substrate
Meas. Tech.
ChEMBL_716556 (CHEMBL1670280)
IC50
3060±n/a nM
Citation
 Jiang, CSZhou, RGong, JXChen, LLKurtán, TShen, XGuo, YW Synthesis, modification, and evaluation of (R)-de-O-methyllasiodiplodin and analogs as nonsteroidal antagonists of mineralocorticoid receptor. Bioorg Med Chem Lett 21:1171-5 (2011)  
Target
Name:
Progesterone receptor
Synonyms:
NR3C3 PGR PRGR_HUMAN | progesterone
Type:
Protein
Mol. Mass.:
98979.52
Organism:
Homo sapiens (Human)
Description:
P06401
Residue:
933
  
Inhibitor
Name:
BDBM50336276
Synonyms:
1-oxo-1,3,4,5,6,7,8,9,10,11-decahydrobenzo[c][1]oxacyclotridecine-13,15-diyl diacetate | CHEMBL1669774
Type:
Small organic molecule
Emp. Form.:
C20H26O6
Mol. Mass.:
362.4168
SMILES:
CC(=O)Oc1cc2CCCCCCCCCOC(=O)c2c(OC(C)=O)c1
: