Target
Insulin-like growth factor 1 receptor
Ligand
BDBM50336325
Substrate
Meas. Tech.
ChEMBL_716595 (CHEMBL1670374)
IC50
2±n/a nM
Citation
 Jin, MKleinberg, ACooke, AGokhale, PCForeman, KDong, HSiu, KWBittner, MAMulvihill, KMYao, YLandfair, DO'Connor, MMak, GPachter, JAWild, RRosenfeld-Franklin, MJi, QMulvihill, MJ Potent and selective cyclohexyl-derived imidazopyrazine insulin-like growth factor 1 receptor inhibitors with in vivo efficacy. Bioorg Med Chem Lett 21:1176-80 (2011)  
Target
Name:
Insulin-like growth factor 1 receptor
Synonyms:
CD_antigen=CD221 IGF1R Insulin-like growth factor 1 receptor (IGF1R) Insulin-like growth factor 1 receptor alpha chain Insulin-like growth factor I receptor | Insulin-like growth factor receptor (IGFR)
Type:
Protein
Mol. Mass.:
154776.79
Organism:
Homo sapiens (Human)
Description:
P08069
Residue:
1367
  
Inhibitor
Name:
BDBM50336325
Synonyms:
CHEMBL1667943 | trans-4-(8-amino-1-(8-fluoro-2-phenylquinolin-7-yl)imidazo[1,5-a]pyrazin-3-yl)-N-(thiazol-2-yl)cyclohexanecarboxamide
Type:
Small organic molecule
Emp. Form.:
C31H26FN7OS
Mol. Mass.:
563.648
SMILES:
Nc1nccn2c(nc(-c3ccc4ccc(nc4c3F)-c3ccccc3)c12)[C@H]1CC[C@@H](CC1)C(=O)Nc1nccs1
: