Target
Platelet-derived growth factor receptor beta
Ligand
BDBM50336460
Substrate
Meas. Tech.
ChEMBL_716844 (CHEMBL1670766)
IC50
>100000±n/a nM
Citation
 Napolitano, CNatoni, ASantocanale, CEvensen, LLorens, JBMurphy, PV Isosteric replacement of the Z-enone with haloethyl ketone and E-enone in a resorcylic acid lactone series and biological evaluation. Bioorg Med Chem Lett 21:1167-70 (2011)  
Target
Name:
Platelet-derived growth factor receptor beta
Synonyms:
Beta-type platelet-derived growth factor receptor CD140b antigen PDGF Receptor Substrate PDGFR PDGFR-1 PDGFRB PGFRB_HUMAN Platelet-derived growth factor receptor 1 Platelet-derived growth factor receptor beta (PDGFR-beta) Platelet-derived growth factor receptor beta (PDGFRbeta) | VHL/PDGFRB
Type:
Enzyme
Mol. Mass.:
123922.25
Organism:
Homo sapiens (Human)
Description:
P09619
Residue:
1106
  
Inhibitor
Name:
BDBM50336460
Synonyms:
(S,9E,15Z)-2-ethyl-4,7-dimethyl-5,11-dimethylene-5,6,7,8,11,12,13,14-octahydrobenzo[14]annulene | CHEMBL1668420
Type:
Small organic molecule
Emp. Form.:
C19H22O5
Mol. Mass.:
330.375
SMILES:
COc1cc(O)c2c(c1)C=CCCCC(=O)C=CC[C@H](C)OC2=O
: