Target
Platelet-derived growth factor receptor beta
Ligand
BDBM50336461
Substrate
Meas. Tech.
ChEMBL_716844 (CHEMBL1670766)
IC50
21000±n/a nM
Citation
 Napolitano, CNatoni, ASantocanale, CEvensen, LLorens, JBMurphy, PV Isosteric replacement of the Z-enone with haloethyl ketone and E-enone in a resorcylic acid lactone series and biological evaluation. Bioorg Med Chem Lett 21:1167-70 (2011)  
Target
Name:
Platelet-derived growth factor receptor beta
Synonyms:
Beta-type platelet-derived growth factor receptor CD140b antigen PDGF Receptor Substrate PDGFR PDGFR-1 PDGFRB PGFRB_HUMAN Platelet-derived growth factor receptor 1 Platelet-derived growth factor receptor beta (PDGFR-beta) Platelet-derived growth factor receptor beta (PDGFRbeta) | VHL/PDGFRB
Type:
Enzyme
Mol. Mass.:
123922.25
Organism:
Homo sapiens (Human)
Description:
P09619
Residue:
1106
  
Inhibitor
Name:
BDBM50336461
Synonyms:
(S,E)-16-hydroxy-14-methoxy-3-methyl-3,4,9,10,11,12-hexahydro-1H-benzo[c][1]oxacyclotetradecine-1,7(8H)-dione | CHEMBL1668419
Type:
Small organic molecule
Emp. Form.:
C19H24O5
Mol. Mass.:
332.3909
SMILES:
COc1cc(O)c2c(CCCCCC(=O)C=CC[C@H](C)OC2=O)c1
: