Target
Mast/stem cell growth factor receptor Kit
Ligand
BDBM50336461
Substrate
Meas. Tech.
ChEMBL_716845 (CHEMBL1670767)
IC50
1300±n/a nM
Citation
 Napolitano, CNatoni, ASantocanale, CEvensen, LLorens, JBMurphy, PV Isosteric replacement of the Z-enone with haloethyl ketone and E-enone in a resorcylic acid lactone series and biological evaluation. Bioorg Med Chem Lett 21:1167-70 (2011)  
Target
Name:
Mast/stem cell growth factor receptor Kit
Synonyms:
CD117 antigen KIT Mast/stem cell growth factor receptor Kit (cKIT) Proto-oncogene tyrosine-protein kinase Kit Stem cell growth factor receptor Tyrosine-protein kinase Kit c-kit v-kit Hardy-Zuckerman 4 feline sarcoma viral oncogene homolog
Type:
Protein
Mol. Mass.:
109869.37
Organism:
Homo sapiens (Human)
Description:
P10721
Residue:
976
  
Inhibitor
Name:
BDBM50336461
Synonyms:
(S,E)-16-hydroxy-14-methoxy-3-methyl-3,4,9,10,11,12-hexahydro-1H-benzo[c][1]oxacyclotetradecine-1,7(8H)-dione | CHEMBL1668419
Type:
Small organic molecule
Emp. Form.:
C19H24O5
Mol. Mass.:
332.3909
SMILES:
COc1cc(O)c2c(CCCCCC(=O)C=CC[C@H](C)OC2=O)c1
: