Target
Mitogen-activated protein kinase 1
Ligand
BDBM50336459
Substrate
Meas. Tech.
ChEMBL_716848 (CHEMBL1670770)
IC50
>100000±n/a nM
Citation
 Napolitano, CNatoni, ASantocanale, CEvensen, LLorens, JBMurphy, PV Isosteric replacement of the Z-enone with haloethyl ketone and E-enone in a resorcylic acid lactone series and biological evaluation. Bioorg Med Chem Lett 21:1167-70 (2011)  
Target
Name:
Mitogen-activated protein kinase 1
Synonyms:
ERK2 Extracellular signal-regulated kinase 2 Extracellular signal-regulated kinase 2 (ERK2) MAPK 2 MK01_HUMAN Mitogen-activated protein kinase 1 (ERK-2) Mitogen-activated protein kinase 2 PRKM2 | p42-MAPK
Type:
Ser/Thr Protein Kinase
Mol. Mass.:
41392.76
Organism:
Homo sapiens (Human)
Description:
P28482
Residue:
360
  
Inhibitor
Name:
BDBM50336459
Synonyms:
(S,5E,11E)-16-hydroxy-14-methoxy-3-methyl-3,4,9,10-tetrahydro-1H-benzo[c][1]oxacyclotetradecine-1,7(8H)-dione | CHEMBL1668418
Type:
Small organic molecule
Emp. Form.:
C19H22O5
Mol. Mass.:
330.375
SMILES:
COc1cc(O)c2c(c1)C=CCCCC(=O)C=CC[C@H](C)OC2=O
: