Target
Multidrug resistance protein MdtK
Ligand
BDBM21690
Substrate
Meas. Tech.
ChEMBL_720698 (CHEMBL1681165)
Kd
90900±n/a nM
Citation
 Long, FRouquette-Loughlin, CShafer, WMYu, EW Functional cloning and characterization of the multidrug efflux pumps NorM from Neisseria gonorrhoeae and YdhE from Escherichia coli. Antimicrob Agents Chemother 52:3052-60 (2008)  
Target
Name:
Multidrug resistance protein MdtK
Synonyms:
MDTK_ECOLI mdtK norM | ydhE
Type:
PROTEIN
Mol. Mass.:
49460.10
Organism:
Escherichia coli (strain K12)
Description:
ChEMBL_720698
Residue:
457
  
Inhibitor
Name:
BDBM21690
Synonyms:
1-cyclopropyl-6-fluoro-4-oxo-7-(piperazin-1-yl)-1,4-dihydroquinoline-3-carboxylic acid Bay 09867 Ciprinol Ciprofloxacin US9138393, Ciprofloxacin HCl | US9144538, Ciprofloxacin HCl
Type:
Small organic molecule
Emp. Form.:
C17H18FN3O3
Mol. Mass.:
331.3415
SMILES:
OC(=O)c1cn(C2CC2)c2cc(N3CCNCC3)c(F)cc2c1=O
: