Target
Phosphodiesterase
Ligand
BDBM50336517
Substrate
Meas. Tech.
ChEMBL_723718 (CHEMBL1677388)
IC50
>10000±n/a nM
Citation
 King-Keller, SLi, MSmith, AZheng, SKaur, GYang, XWang, BDocampo, R Chemical validation of phosphodiesterase C as a chemotherapeutic target in Trypanosoma cruzi, the etiological agent of Chagas' disease. Antimicrob Agents Chemother 54:3738-45 (2010)  
Target
Name:
Phosphodiesterase
Synonyms:
Cyclic nucleotide specific phosphodiesterase | Phosphodiesterase (TcrPDEC)
Type:
Protein
Mol. Mass.:
103074.59
Organism:
Trypanosoma cruzi
Description:
Q53I59
Residue:
924
  
Inhibitor
Name:
BDBM50336517
Synonyms:
1-cyclopentyl-3-(4-(piperidin-1-ylsulfonyl)phenyl)urea | CHEMBL1673332
Type:
Small organic molecule
Emp. Form.:
C17H25N3O3S
Mol. Mass.:
351.464
SMILES:
O=C(NC1CCCC1)Nc1ccc(cc1)S(=O)(=O)N1CCCCC1
: