Target
Delta-type opioid receptor
Ligand
BDBM50336592
Substrate
Meas. Tech.
ChEMBL_725618 (CHEMBL1677801)
Ki
43±n/a nM
Citation
 Spetea, MWindisch, PGuo, YBileviciute-Ljungar, ISchütz, JAsim, MFBerzetei-Gurske, IPRiba, PKiraly, KFürst, SAl-Khrasani, MSchmidhammer, H Synthesis and pharmacological activities of 6-glycine substituted 14-phenylpropoxymorphinans, a novel class of opioids with high opioid receptor affinities and antinociceptive potencies. J Med Chem 54:980-8 (2011)  
Target
Name:
Delta-type opioid receptor
Synonyms:
Cytochrome P450 3A4 Delta opioid receptor Delta-type opioid receptor (DOR) OPRD_RAT Opioid receptor Opioid receptors; mu & delta Ror-a | Voltage-gated potassium channel
Type:
G Protein-Coupled Receptor (GPCR)
Mol. Mass.:
40465.04
Organism:
Rattus norvegicus (rat)
Description:
Competition binding assays were using CHO-K1 cell membranes expressing the opioid receptor.
Residue:
372
  
Inhibitor
Name:
BDBM50336592
Synonyms:
2-{[(1S,5R,13R,14S,17S)-10-hydroxy-17-methoxy-4-methyl-12-oxa-4-azapentacyclo[9.6.1.0^{1,13}.0^{5,17}.0^{7,18}]octadeca-7(18),8,10-trien-14-yl]amino}acetic acid | CHEMBL1672084
Type:
Small organic molecule
Emp. Form.:
C20H26N2O5
Mol. Mass.:
374.4308
SMILES:
CO[C@]12CC[C@H](NCC(O)=O)[C@@H]3Oc4c5c(C[C@H]1N(C)CC[C@@]235)ccc4O
: