Target
Carbonic anhydrase 1
Ligand
BDBM10863
Substrate
Meas. Tech.
ChEMBL_726066 (CHEMBL1678662)
pH
7.5±n/a
Ki
9800±n/a nM
Comments
extracted
Citation
 Joseph, POuahrani-Bettache, SMontero, JLNishimori, IMinakuchi, TVullo, DScozzafava, AWinum, JYKöhler, SSupuran, CT A newß-carbonic anhydrase from Brucella suis, its cloning, characterization, and inhibition with sulfonamides and sulfamates, leading to impaired pathogen growth. Bioorg Med Chem 19:1172-8 (2011)  
Target
Name:
Carbonic anhydrase 1
Synonyms:
CA-I CAB Carbonate dehydratase I Carbonic anhydrase 1 (CA I) Carbonic anhydrase 1 (Recombinant CA I) Carbonic anhydrase B Carbonic anhydrase I (CA I) Carbonic anhydrase I (CAI) Carbonic anhydrase isoenzyme I (hCA I) | hCA
Type:
Enzyme
Mol. Mass.:
28873.37
Organism:
Homo sapiens (Human)
Description:
P00915
Residue:
261
  
Inhibitor
Name:
BDBM10863
Synonyms:
4-Amino-3-chlorobenzenesulfonamide CHEMBL7092 halogenosulfanilamide deriv. 5c
Type:
Small organic molecule
Emp. Form.:
C6H7ClN2O2S
Mol. Mass.:
206.65
SMILES:
Nc1ccc(cc1Cl)S(N)(=O)=O
: