Target
Bile acid receptor
Ligand
BDBM30329
Substrate
Meas. Tech.
ChEMBL_726091 (CHEMBL1678687)
EC50
87±n/a nM
Citation
 Bass, JYCaravella, JAChen, LCreech, KLDeaton, DNMadauss, KPMarr, HBMcFadyen, RBMiller, ABMills, WYNavas, FParks, DJSmalley, TLSpearing, PKTodd, DWilliams, SPWisely, GB Conformationally constrained farnesoid X receptor (FXR) agonists: heteroaryl replacements of the naphthalene. Bioorg Med Chem Lett 21:1206-13 (2011)  
Target
Name:
Bile acid receptor
Synonyms:
BAR FXR HRR1 NR1H4_HUMAN RIP14 Retinoid X receptor-interacting protein 14 | farnesoid x receptor
Type:
Nuclear Receptor
Mol. Mass.:
55916.24
Organism:
Homo sapiens (Human)
Description:
Q96RI1
Residue:
486
  
Inhibitor
Name:
BDBM30329
Synonyms:
Naphthoic acid-based analog, 1b
Type:
Small organic molecule
Emp. Form.:
C30H23Cl2NO4
Mol. Mass.:
532.414
SMILES:
CC(C)c1onc(c1COc1ccc(cc1)-c1ccc2c(cccc2c1)C(O)=O)-c1c(Cl)cccc1Cl
: