Target
Mu-type opioid receptor
Ligand
BDBM50336664
Substrate
Meas. Tech.
ChEMBL_722917 (CHEMBL1674428)
Ki
0.0828±n/a nM
Citation
 Nemoto, TYamamoto, NWatanabe, AFujii, HHasebe, KNakajima, MMochizuki, HNagase, H Synthesis of 6,14-epoxymorphinan derivatives and their pharmacologies. Bioorg Med Chem 19:1205-21 (2011)  
Target
Name:
Mu-type opioid receptor
Synonyms:
M-OR-1 Mu opioid receptor OPIATE Mu OPRM_CAVPO
Type:
Enzyme Catalytic Domain
Mol. Mass.:
11165.58
Organism:
GUINEA PIG
Description:
P97266
Residue:
98
  
Inhibitor
Name:
BDBM50336664
Synonyms:
(2E)-N-[(17-Cyclopropylmethyl-6beta,14beta-epoxy-3-hydroxymorphinan-6alpha-yl)methyl]-(3-furyl)acrylamide | CHEMBL1672472
Type:
Small organic molecule
Emp. Form.:
C28H32N2O4
Mol. Mass.:
460.5647
SMILES:
Oc1ccc2C[C@H]3N(CC4CC4)CC[C@@]4(C[C@]5(CNC(=O)\C=C\c6ccoc6)CC[C@@]34O5)c2c1
: