Target
Endothelin-1 receptor
Ligand
BDBM50336694
Substrate
Meas. Tech.
ChEMBL_723169 (CHEMBL1675391)
Ki
1.4±n/a nM
Citation
 Michel, KBüther, KLaw, MPWagner, SSchober, OHermann, SSchäfers, MRiemann, BHöltke, CKopka, K Development and evaluation of endothelin-A receptor (radio)ligands for positron emission tomography. J Med Chem 54:939-48 (2011)  
Target
Name:
Endothelin-1 receptor
Synonyms:
EDNRA_MOUSE Endothelin receptor ET-A | Gpcr10
Type:
PROTEIN
Mol. Mass.:
48591.87
Organism:
Mus musculus
Description:
ChEMBL_723169
Residue:
427
  
Inhibitor
Name:
BDBM50336694
Synonyms:
3-Benzo[1,3]dioxol-5-yl-4-{3-(2-(2-(2-(2-fluoroethoxy)ethoxy)-ethoxy)ethoxy)-4,5-dimethoxybenzyl}-5-hydroxy-5-(4-methoxyphenyl)-5H-furan-2-one | CHEMBL1672880
Type:
Small organic molecule
Emp. Form.:
C35H39FO12
Mol. Mass.:
670.6754
SMILES:
COc1ccc(cc1)C1(O)OC(=O)C(=C1Cc1cc(OC)c(OC)c(OCCOCCOCCOCCF)c1)c1ccc2OCOc2c1
: