Target
Cytochrome P450 2D6
Ligand
BDBM50336975
Substrate
Meas. Tech.
ChEMBL_719027 (CHEMBL1679089)
IC50
>25000±n/a nM
Citation
 Eastwood, PEsteve, CGonzález, JFonquerna, SAiguadé, JCarranco, IsDoménech, TAparici, MsMiralpeix, MAlbertí, JCórdoba, MFernández, RPont, MsGodessart, NsPrats, NLoza, MsCadavid, MsNueda, A Discovery of LAS101057: A Potent, Selective, and Orally Efficacious A2B Adenosine Receptor Antagonist ACS Med Chem Lett 2:213-218 (2011)  
Target
Name:
Cytochrome P450 2D6
Synonyms:
CP2D6_HUMAN CYP2DL1 Cytochrome P450 2D6 (CYP2D6) P450-DB1
Type:
Protein
Mol. Mass.:
55774.82
Organism:
Homo sapiens (Human)
Description:
P10635
Residue:
497
  
Inhibitor
Name:
BDBM50336975
Synonyms:
CHEMBL1672621 | N-(6-Pyridin-3-yl-5-pyridin-4-ylpyrazin-2-yl)cyclopropanecarboxamide
Type:
Small organic molecule
Emp. Form.:
C18H15N5O
Mol. Mass.:
317.3446
SMILES:
O=C(Nc1cnc(-c2ccncc2)c(n1)-c1cccnc1)C1CC1
: