Target
Adenosine receptor A2b
Ligand
BDBM50336992
Substrate
Meas. Tech.
ChEMBL_719009 (CHEMBL1679071)
Ki
56±n/a nM
Citation
 Eastwood, PEsteve, CGonzález, JFonquerna, SAiguadé, JCarranco, IsDoménech, TAparici, MsMiralpeix, MAlbertí, JCórdoba, MFernández, RPont, MsGodessart, NsPrats, NLoza, MsCadavid, MsNueda, A Discovery of LAS101057: A Potent, Selective, and Orally Efficacious A2B Adenosine Receptor Antagonist ACS Med Chem Lett 2:213-218 (2011)  
Target
Name:
Adenosine receptor A2b
Synonyms:
AA2BR_HUMAN ADORA2B Adenosine receptors A2b | Adenosine receptors; A2a & A2b
Type:
G Protein-Coupled Receptor (GPCR)
Mol. Mass.:
36341.22
Organism:
Homo sapiens (Human)
Description:
Residue:
332
  
Inhibitor
Name:
BDBM50336992
Synonyms:
CHEMBL1672624 | N-(6-(oxazol-2-yl)-5-(pyridin-4-yl)pyrazin-2-yl)cyclopropanecarboxamide
Type:
Small organic molecule
Emp. Form.:
C16H13N5O2
Mol. Mass.:
307.3067
SMILES:
O=C(Nc1cnc(-c2ccncc2)c(n1)-c1ncco1)C1CC1
: