Target
Adenosine receptor A2b
Ligand
BDBM50336978
Substrate
Meas. Tech.
ChEMBL_719009 (CHEMBL1679071)
Ki
11±n/a nM
Citation
 Eastwood, PEsteve, CGonzález, JFonquerna, SAiguadé, JCarranco, IsDoménech, TAparici, MsMiralpeix, MAlbertí, JCórdoba, MFernández, RPont, MsGodessart, NsPrats, NLoza, MsCadavid, MsNueda, A Discovery of LAS101057: A Potent, Selective, and Orally Efficacious A2B Adenosine Receptor Antagonist ACS Med Chem Lett 2:213-218 (2011)  
Target
Name:
Adenosine receptor A2b
Synonyms:
AA2BR_HUMAN ADORA2B Adenosine receptors A2b | Adenosine receptors; A2a & A2b
Type:
G Protein-Coupled Receptor (GPCR)
Mol. Mass.:
36341.22
Organism:
Homo sapiens (Human)
Description:
Residue:
332
  
Inhibitor
Name:
BDBM50336978
Synonyms:
CHEMBL1672630 | N-(5-(3-chloropyridin-4-yl)-6-(pyridin-2-yl)pyrazin-2-yl)cyclopropanecarboxamide
Type:
Small organic molecule
Emp. Form.:
C18H14FN5O
Mol. Mass.:
335.3351
SMILES:
Fc1cnccc1-c1ncc(NC(=O)C2CC2)nc1-c1ccncc1
: