Target
Adenosine receptor A2a
Ligand
BDBM50336991
Substrate
Meas. Tech.
ChEMBL_719010 (CHEMBL1679072)
Ki
51±n/a nM
Citation
 Eastwood, PEsteve, CGonzález, JFonquerna, SAiguadé, JCarranco, IsDoménech, TAparici, MsMiralpeix, MAlbertí, JCórdoba, MFernández, RPont, MsGodessart, NsPrats, NLoza, MsCadavid, MsNueda, A Discovery of LAS101057: A Potent, Selective, and Orally Efficacious A2B Adenosine Receptor Antagonist ACS Med Chem Lett 2:213-218 (2011)  
Target
Name:
Adenosine receptor A2a
Synonyms:
A2A adenosine receptor (hA2A) ADENOSINE A2 ADORA2 Adenosine A2A receptor (A2AAR)
Type:
G Protein-Coupled Receptor (GPCR)
Mol. Mass.:
44716.46
Organism:
Homo sapiens (Human)
Description:
P29274
Residue:
412
  
Inhibitor
Name:
BDBM50336991
Synonyms:
CHEMBL1672623 | N-[6-(2-Fluorophenyl)-5-pyridin-4-ylpyrazin-2-yl]cyclopropanecarboxamide
Type:
Small organic molecule
Emp. Form.:
C19H15FN4O
Mol. Mass.:
334.347
SMILES:
Fc1ccccc1-c1nc(NC(=O)C2CC2)cnc1-c1ccncc1
: