Target
Adenosine receptor A3
Ligand
BDBM50336986
Substrate
Meas. Tech.
ChEMBL_719013 (CHEMBL1679075)
Ki
4076±n/a nM
Citation
 Eastwood, PEsteve, CGonzález, JFonquerna, SAiguadé, JCarranco, IsDoménech, TAparici, MsMiralpeix, MAlbertí, JCórdoba, MFernández, RPont, MsGodessart, NsPrats, NLoza, MsCadavid, MsNueda, A Discovery of LAS101057: A Potent, Selective, and Orally Efficacious A2B Adenosine Receptor Antagonist ACS Med Chem Lett 2:213-218 (2011)  
Target
Name:
Adenosine receptor A3
Synonyms:
A3 adenosine receptor (hA3) ADORA3 | Adenosine A3 receptor (A3AR)
Type:
G Protein-Coupled Receptor (GPCR)
Mol. Mass.:
36197.32
Organism:
Homo sapiens (Human)
Description:
P0DMS8
Residue:
318
  
Inhibitor
Name:
BDBM50336986
Synonyms:
CHEMBL1672616 | N-[6-(2-Furyl)-5-pyridin-4-ylpyrazin-2-yl]cyclopentanecarboxamide
Type:
Small organic molecule
Emp. Form.:
C19H18N4O2
Mol. Mass.:
334.3718
SMILES:
O=C(Nc1cnc(-c2ccncc2)c(n1)-c1ccco1)C1CCCC1
: