Target
Hydroxycarboxylic acid receptor 2
Ligand
BDBM50337038
Substrate
Meas. Tech.
ChEMBL_718717 (CHEMBL1680936)
EC50
4±n/a nM
Citation
 Qin, JRao, AChen, XZhu, XLiu, ZHuang, XDegrado, SHuang, YXiao, DAslanian, RCheewatrakoolpong, BZhang, HGreenfeder, SFarley, CCook, JKurowski, SLi, QHeek, MvChintala, MWang, GHsieh, YLi, F Discovery of a Potent Nicotinic Acid Receptor Agonist for the Treatment of Dyslipidemia ACS Med Chem Lett 2:171-176 (2011)  
Target
Name:
Hydroxycarboxylic acid receptor 2
Synonyms:
Gpr109 Gpr109b HM74 nicotinic acid GPCR Niacr1 | Pumag
Type:
PROTEIN
Mol. Mass.:
41418.01
Organism:
Mus musculus
Description:
ChEMBL_820676
Residue:
360
  
Inhibitor
Name:
BDBM50337038
Synonyms:
5-(3-cyclopropylpropyl)-2-(difluoromethyl)-3H-pyrano[2,3-d]pyrimidine-4,7-dione | CHEMBL1671877
Type:
Small organic molecule
Emp. Form.:
C14H14F2N2O3
Mol. Mass.:
296.2694
SMILES:
FC(F)c1nc2oc(=O)cc(CCCC3CC3)c2c(=O)[nH]1
: