Target
Signal transducer and activator of transcription 3
Ligand
BDBM50337208
Substrate
Meas. Tech.
ChEMBL_726326 (CHEMBL1687314)
Ki
26000±n/a nM
Citation
 Shahani, VMYue, PFletcher, SSharmeen, SSukhai, MALuu, DPZhang, XSun, HZhao, WSchimmer, ADTurkson, JGunning, PT Design, synthesis, and in vitro characterization of novel hybrid peptidomimetic inhibitors of STAT3 protein. Bioorg Med Chem 19:1823-38 (2011)  
Target
Name:
Signal transducer and activator of transcription 3
Synonyms:
Acute-phase response factor STAT3 alpha Signal transducer and activator of transcription 3 Transcription Factor STAT3
Type:
Cytosolic Transcription Factor
Mol. Mass.:
88050.28
Organism:
Mus musculus (mouse)
Description:
Bacterially expressed protein was used in the FP assay.
Residue:
770
  
Inhibitor
Name:
BDBM50337208
Synonyms:
CHEMBL1684874 | Methyl 2'-(benzylcarbamoyl)-5'-((S)-2-((S)-2-(4-cyanobenzamido)-3-(4-(phosphonooxy)phenyl)propanamido)-4-methylpentanamido)-[1,1'-biphenyl]-4-carboxylate
Type:
Small organic molecule
Emp. Form.:
C45H44N5O10P
Mol. Mass.:
845.8321
SMILES:
COC(=O)c1ccc(cc1)-c1cc(NC(=O)[C@H](CC(C)C)NC(=O)[C@H](Cc2ccc(OP(O)(O)=O)cc2)NC(=O)c2ccc(cc2)C#N)ccc1C(=O)NCc1ccccc1
: