Target
Signal transducer and activator of transcription 3
Ligand
BDBM50337197
Substrate
Meas. Tech.
ChEMBL_726330 (CHEMBL1687318)
Kd
17±n/a nM
Citation
 Shahani, VMYue, PFletcher, SSharmeen, SSukhai, MALuu, DPZhang, XSun, HZhao, WSchimmer, ADTurkson, JGunning, PT Design, synthesis, and in vitro characterization of novel hybrid peptidomimetic inhibitors of STAT3 protein. Bioorg Med Chem 19:1823-38 (2011)  
Target
Name:
Signal transducer and activator of transcription 3
Synonyms:
Acute-phase response factor STAT3 alpha Signal transducer and activator of transcription 3 Transcription Factor STAT3
Type:
Cytosolic Transcription Factor
Mol. Mass.:
88050.28
Organism:
Mus musculus (mouse)
Description:
Bacterially expressed protein was used in the FP assay.
Residue:
770
  
Inhibitor
Name:
BDBM50337197
Synonyms:
CHEMBL1684876 | N3-benzyl-5-((S)-2-((S)-2-(4-cyanobenzamido)-3-(4-hydroxyphenyl)propanamido)-4-methylpentanamido)biphenyl-3,4'-dicarboxamide
Type:
Small organic molecule
Emp. Form.:
C44H42N6O6
Mol. Mass.:
750.8409
SMILES:
CC(C)C[C@H](NC(=O)[C@H](Cc1ccc(O)cc1)NC(=O)c1ccc(cc1)C#N)C(=O)Nc1cc(cc(c1)-c1ccc(cc1)C(N)=O)C(=O)NCc1ccccc1
: