Target
Serine/threonine-protein kinase pim-1
Ligand
BDBM50337325
Substrate
Meas. Tech.
ChEMBL_726512 (CHEMBL1685407)
Ki
5155±n/a nM
Citation
 Akritopoulou-Zanze, IWakefield, BDGasiecki, AKalvin, DJohnson, EFKovar, PDjuric, SW Scaffold oriented synthesis. Part 3: design, synthesis and biological evaluation of novel 5-substituted indazoles as potent and selective kinase inhibitors employing [2+3] cycloadditions. Bioorg Med Chem Lett 21:1476-9 (2011)  
Target
Name:
Serine/threonine-protein kinase pim-1
Synonyms:
PIM-1 Kinase PIM1_HUMAN Serine/threonine-protein kinase (PIM1) Serine/threonine-protein kinase PIM1 | Serine/threonine-protein kinase pim-1 (PIM1)
Type:
Protein
Mol. Mass.:
35681.82
Organism:
Homo sapiens (Human)
Description:
P11309
Residue:
313
  
Inhibitor
Name:
BDBM50337325
Synonyms:
5-(3-benzylisoxazol-5-yl)-1H-indazol-3-amine | CHEMBL1682358
Type:
Small organic molecule
Emp. Form.:
C17H14N4O
Mol. Mass.:
290.3193
SMILES:
Nc1n[nH]c2ccc(cc12)-c1cc(Cc2ccccc2)no1
: