Target
Vascular endothelial growth factor receptor 2
Ligand
BDBM50337310
Substrate
Meas. Tech.
ChEMBL_726510 (CHEMBL1685405)
Ki
>8880±n/a nM
Citation
 Akritopoulou-Zanze, IWakefield, BDGasiecki, AKalvin, DJohnson, EFKovar, PDjuric, SW Scaffold oriented synthesis. Part 3: design, synthesis and biological evaluation of novel 5-substituted indazoles as potent and selective kinase inhibitors employing [2+3] cycloadditions. Bioorg Med Chem Lett 21:1476-9 (2011)  
Target
Name:
Vascular endothelial growth factor receptor 2
Synonyms:
CD_antigen=CD309 Fetal liver kinase 1 (FLK-1) KDR Protein-tyrosine kinase receptor Flk-1 VEGFR-2 VEGFR2 Vascular Endothelial Growth Factor Receptor Kinase 2 Vascular endothelial growth factor receptor 2 (KDR) Vascular endothelial growth factor receptor 2 (VEGFR2) Vascular endothelial growth factor receptor-2 (VEGFR-2)
Type:
Receptor Tyrosine Kinase
Mol. Mass.:
151510.97
Organism:
Homo sapiens (Human)
Description:
P35968
Residue:
1356
  
Inhibitor
Name:
BDBM50337310
Synonyms:
5-(4-benzyl-1H-1,2,3-triazol-1-yl)-1H-indazole | CHEMBL1682341
Type:
Small organic molecule
Emp. Form.:
C16H13N5
Mol. Mass.:
275.3079
SMILES:
C(c1cn(nn1)-c1ccc2[nH]ncc2c1)c1ccccc1
: