Target
Glycogen synthase kinase-3 beta
Ligand
BDBM50337365
Substrate
Meas. Tech.
ChEMBL_726536 (CHEMBL1685431)
Ki
141±n/a nM
Citation
 Akritopoulou-Zanze, IWakefield, BDGasiecki, AKalvin, DJohnson, EFKovar, PDjuric, SW Scaffold oriented synthesis. Part 4: design, synthesis and biological evaluation of novel 5-substituted indazoles as potent and selective kinase inhibitors employing heterocycle forming and multicomponent reactions. Bioorg Med Chem Lett 21:1480-3 (2011)  
Target
Name:
Glycogen synthase kinase-3 beta
Synonyms:
GSK-3 beta GSK3B Glycogen synthase kinase 3 beta (GSK3B) Glycogen synthase kinase-3 beta (GSK-3B) Glycogen synthase kinase-3 beta (GSK3B) Glycogen synthase kinase-3beta (GSK3B) | Serine/threonine-protein kinase GSK3B
Type:
Enzyme
Mol. Mass.:
46756.38
Organism:
Homo sapiens (Human)
Description:
P49841
Residue:
420
  
Inhibitor
Name:
BDBM50337365
Synonyms:
2-(1H-indazol-5-yl)imidazo[1,2-a]pyrimidine | CHEMBL1682540
Type:
Small organic molecule
Emp. Form.:
C13H9N5
Mol. Mass.:
235.2441
SMILES:
c1n[nH]c2ccc(cc12)-c1cn2cccnc2n1
: