Target
Serine/threonine-protein kinase pim-1
Ligand
BDBM50337371
Substrate
Meas. Tech.
ChEMBL_726540 (CHEMBL1685435)
Ki
>8750±n/a nM
Citation
 Akritopoulou-Zanze, IWakefield, BDGasiecki, AKalvin, DJohnson, EFKovar, PDjuric, SW Scaffold oriented synthesis. Part 4: design, synthesis and biological evaluation of novel 5-substituted indazoles as potent and selective kinase inhibitors employing heterocycle forming and multicomponent reactions. Bioorg Med Chem Lett 21:1480-3 (2011)  
Target
Name:
Serine/threonine-protein kinase pim-1
Synonyms:
PIM-1 Kinase PIM1_HUMAN Serine/threonine-protein kinase (PIM1) Serine/threonine-protein kinase PIM1 | Serine/threonine-protein kinase pim-1 (PIM1)
Type:
Protein
Mol. Mass.:
35681.82
Organism:
Homo sapiens (Human)
Description:
P11309
Residue:
313
  
Inhibitor
Name:
BDBM50337371
Synonyms:
CHEMBL1682546 | N-benzyl-4-(1H-indazol-5-yl)thiazol-2-amine
Type:
Small organic molecule
Emp. Form.:
C17H14N4S
Mol. Mass.:
306.385
SMILES:
C(Nc1nc(cs1)-c1ccc2[nH]ncc2c1)c1ccccc1
: