Target
Metabotropic glutamate receptor 5
Ligand
BDBM50231741
Substrate
Meas. Tech.
ChEMBL_728398 (CHEMBL1685174)
EC50
14±n/a nM
Citation
 Varnes, JGMarcus, APMauger, RCThroner, SRHoesch, VKing, MMWang, XSygowski, LASpear, NGadient, RBrown, DGCampbell, JB Discovery of novel positive allosteric modulators of the metabotropic glutamate receptor 5 (mGlu5). Bioorg Med Chem Lett 21:1402-6 (2011)  
Target
Name:
Metabotropic glutamate receptor 5
Synonyms:
GPRC1E GRM5_HUMAN metabotropic glutamate 5 | metabotropic glutamate 5a
Type:
Enzyme
Mol. Mass.:
132484.72
Organism:
Homo sapiens (Human)
Description:
Residue:
1212
  
Inhibitor
Name:
BDBM50231741
Synonyms:
2-phenylethynyl-7,8-dihydro-6H-quinolin-5-one | CHEMBL252956
Type:
Small organic molecule
Emp. Form.:
C17H13NO
Mol. Mass.:
247.2912
SMILES:
O=C1CCCc2nc(ccc12)C#Cc1ccccc1
: