Target
Proto-oncogene tyrosine-protein kinase Src
Ligand
BDBM50337684
Substrate
Meas. Tech.
ChEMBL_728800 (CHEMBL1686335)
IC50
>75000±n/a nM
Citation
 Kumar, AAhmad, IChhikara, BSTiwari, RMandal, DParang, K Synthesis of 3-phenylpyrazolopyrimidine-1,2,3-triazole conjugates and evaluation of their Src kinase inhibitory and anticancer activities. Bioorg Med Chem Lett 21:1342-6 (2011)  
Target
Name:
Proto-oncogene tyrosine-protein kinase Src
Synonyms:
Calmodulin/Proto-oncogene tyrosine-protein kinase Src Proto-oncogene c-Src SRC SRC_HUMAN V-src sarcoma (Schmidt-Ruppin A-2) viral oncogene homolog (avian) p60-Src | pp60c-src
Type:
Protein
Mol. Mass.:
59838.60
Organism:
Homo sapiens (Human)
Description:
P12931
Residue:
536
  
Inhibitor
Name:
BDBM50337684
Synonyms:
2-(4-((4-Amino-3-phenyl-1H-pyrazolo[3,4-d]pyrimidin-1-yl)methyl)-1H-1,2,3-triazol-1-yl)-1-phenylethanone | CHEMBL1683301
Type:
Small organic molecule
Emp. Form.:
C22H18N8O
Mol. Mass.:
410.4313
SMILES:
Nc1ncnc2n(Cc3cn(CC(=O)c4ccccc4)nn3)nc(-c3ccccc3)c12
: