Target
Proto-oncogene tyrosine-protein kinase Src
Ligand
BDBM50337691
Substrate
Meas. Tech.
ChEMBL_728800 (CHEMBL1686335)
IC50
5600±n/a nM
Citation
 Kumar, AAhmad, IChhikara, BSTiwari, RMandal, DParang, K Synthesis of 3-phenylpyrazolopyrimidine-1,2,3-triazole conjugates and evaluation of their Src kinase inhibitory and anticancer activities. Bioorg Med Chem Lett 21:1342-6 (2011)  
Target
Name:
Proto-oncogene tyrosine-protein kinase Src
Synonyms:
Calmodulin/Proto-oncogene tyrosine-protein kinase Src Proto-oncogene c-Src SRC SRC_HUMAN V-src sarcoma (Schmidt-Ruppin A-2) viral oncogene homolog (avian) p60-Src | pp60c-src
Type:
Protein
Mol. Mass.:
59838.60
Organism:
Homo sapiens (Human)
Description:
P12931
Residue:
536
  
Inhibitor
Name:
BDBM50337691
Synonyms:
1-(2-(4-Hexyl-1H-1,2,3-triazol-1-yl)ethyl)-3-phenyl-1H-pyrazolo[3,4-d]pyrimidin-4-amine | CHEMBL1683293
Type:
Small organic molecule
Emp. Form.:
C21H26N8
Mol. Mass.:
390.4847
SMILES:
CCCCCCc1cn(CCn2nc(-c3ccccc3)c3c(N)ncnc23)nn1
: