Target
Carbonic anhydrase 5A, mitochondrial
Ligand
BDBM50337749
Substrate
Meas. Tech.
ChEMBL_726763 (CHEMBL1686237)
Ki
27.5±n/a nM
Citation
 Maresca, ASupuran, CT (R)-/(S)-10-camphorsulfonyl-substituted aromatic/heterocyclic sulfonamides selectively inhibit mitochondrial over cytosolic carbonic anhydrases. Bioorg Med Chem Lett 21:1334-7 (2011)  
Target
Name:
Carbonic anhydrase 5A, mitochondrial
Synonyms:
CA-VA CA5A Carbonate dehydratase VA Carbonic anhydrase 5A (CA VA) Carbonic anhydrase 5A, mitochondrial precursor Carbonic anhydrase VA (CA VA)
Type:
Enzyme
Mol. Mass.:
34755.54
Organism:
Homo sapiens (Human)
Description:
Human (cloned) isozyme
Residue:
305
  
Inhibitor
Name:
BDBM50337749
Synonyms:
4-((((1S)-7,7-dimethyl-2-oxobicyclo[2.2.1]heptan-1-yl)methylsulfonamido)methyl)benzenesulfonamide | CHEMBL1683469
Type:
Small organic molecule
Emp. Form.:
C17H24N2O5S2
Mol. Mass.:
400.513
SMILES:
CC1(C)C2CC[C@@]1(CS(=O)(=O)NCc1ccc(cc1)S(N)(=O)=O)C(=O)C2
: