Target
Dipeptidyl peptidase 4
Ligand
BDBM50337761
Substrate
Meas. Tech.
ChEMBL_726769 (CHEMBL1686243)
IC50
807±n/a nM
Citation
 Park, WSKang, SKJun, MAShin, MSKim, KYRhee, SDBae, MAKim, MSKim, KRKang, NSYoo, SELee, JOSong, DHSilinski, PSchneider, SEAhn, JHKim, SS Discovery ofß-aminoacyl containing thiazolidine derivatives as potent and selective dipeptidyl peptidase IV inhibitors. Bioorg Med Chem Lett 21:1366-70 (2011)  
Target
Name:
Dipeptidyl peptidase 4
Synonyms:
ADABP Adenosine deaminase complexing protein 2 CD_antigen=CD26 DPP4 DPPIV Dipeptidyl peptidase 4 (DPP IV) Dipeptidyl peptidase 4 (DPP4) Dipeptidyl peptidase 4 membrane form Dipeptidyl peptidase IV Dipeptidyl peptidase IV (DDP-IV) Dipeptidyl peptidase IV membrane form Dipeptidyl peptidase-IV (DPP-4) T-cell activation antigen CD26 | TP103
Type:
Enzyme
Mol. Mass.:
88271.01
Organism:
Homo sapiens (Human)
Description:
P27487
Residue:
766
  
Inhibitor
Name:
BDBM50337761
Synonyms:
(3R)-3-amino-1-(2-(morpholine-4-carbonyl)thiazolidin-3-yl)-4-(2,4,5-trifluorophenyl)butan-1-one hydrochloride | CHEMBL1683481
Type:
Small organic molecule
Emp. Form.:
C18H22F3N3O3S
Mol. Mass.:
417.446
SMILES:
N[C@@H](CC(=O)N1CCSC1C(=O)N1CCOCC1)Cc1cc(F)c(F)cc1F
: