Target
Dipeptidyl peptidase 4
Ligand
BDBM50337784
Substrate
Meas. Tech.
ChEMBL_726769 (CHEMBL1686243)
IC50
68±n/a nM
Citation
 Park, WSKang, SKJun, MAShin, MSKim, KYRhee, SDBae, MAKim, MSKim, KRKang, NSYoo, SELee, JOSong, DHSilinski, PSchneider, SEAhn, JHKim, SS Discovery ofß-aminoacyl containing thiazolidine derivatives as potent and selective dipeptidyl peptidase IV inhibitors. Bioorg Med Chem Lett 21:1366-70 (2011)  
Target
Name:
Dipeptidyl peptidase 4
Synonyms:
ADABP Adenosine deaminase complexing protein 2 CD_antigen=CD26 DPP4 DPPIV Dipeptidyl peptidase 4 (DPP IV) Dipeptidyl peptidase 4 (DPP4) Dipeptidyl peptidase 4 membrane form Dipeptidyl peptidase IV Dipeptidyl peptidase IV (DDP-IV) Dipeptidyl peptidase IV membrane form Dipeptidyl peptidase-IV (DPP-4) T-cell activation antigen CD26 | TP103
Type:
Enzyme
Mol. Mass.:
88271.01
Organism:
Homo sapiens (Human)
Description:
P27487
Residue:
766
  
Inhibitor
Name:
BDBM50337784
Synonyms:
CHEMBL1683503 | ethyl 2-(4-((3-((R)-3-amino-4-(2,4,5-trifluorophenyl)butanoyl)thiazolidine-2-carboxamido)methyl)phenylamino)-2-methylpropanoate hydrochloride
Type:
Small organic molecule
Emp. Form.:
C27H33F3N4O4S
Mol. Mass.:
566.636
SMILES:
CCOC(=O)C(C)(C)Nc1ccc(CNC(=O)C2SCCN2C(=O)C[C@H](N)Cc2cc(F)c(F)cc2F)cc1
: