Target
Sodium-dependent noradrenaline transporter
Ligand
BDBM50337836
Substrate
Meas. Tech.
ChEMBL_726927 (CHEMBL1686716)
IC50
10±n/a nM
Citation
 Shao, LHewitt, MCWang, FMalcolm, SCMa, JCampbell, JECampbell, UCEngel, SRSpicer, NAHardy, LWSchreiber, RSpear, KLVarney, MA Discovery of N-methyl-1-(1-phenylcyclohexyl)methanamine, a novel triple serotonin, norepinephrine, and dopamine reuptake inhibitor. Bioorg Med Chem Lett 21:1438-41 (2011)  
Target
Name:
Sodium-dependent noradrenaline transporter
Synonyms:
Monoamine transporter NET Noradrenaline Transporter (NET) Norepinephrine transporter protein (NET) SLC6A2 Sodium-dependent noradrenaline transporter (NET) | Solute carrier family 6 member 2
Type:
Multi-pass membrane protein
Mol. Mass.:
69337.72
Organism:
Homo sapiens (Human)
Description:
P23975
Residue:
617
  
Inhibitor
Name:
BDBM50337836
Synonyms:
1-(1-(3-chloro-4-fluorophenyl)cyclohexyl)-N,N-dimethylmethanamine US10562878, Compound 97
Type:
Small organic molecule
Emp. Form.:
C15H21ClFN
Mol. Mass.:
269.785
SMILES:
CN(C)CC1(CCCCC1)c1ccc(F)c(Cl)c1
: